Uploaded image for project: 'GeoServer'
  1. GEOS-8738

gs-app-schema-postgis-test build fails in PagingTest

    Details

    • Type: Bug
    • Status: Closed
    • Priority: Medium
    • Resolution: Fixed
    • Affects Version/s: 2.14-RC
    • Fix Version/s: 2.14-RC
    • Component/s: Application schema
    • Labels:
      None
    • Environment:

      postgresql-10 10.3-2
      postgresql-10-postgis-2.4 2.4.4+dfsg-1 amd64

      Description

      gs-app-schema-postgis-test fails in PagingTest locally and on Jenkins geoserver-master-app-schema-online:

      Failed tests:   testGetFeatureWithFilter(org.geoserver.test.PagingTest): expected:<1> but was:<3>
      
      Running org.geoserver.test.PagingTest
      Tests run: 10, Failures: 1, Errors: 0, Skipped: 0, Time elapsed: 1.806 sec <<< FAILURE!
      testGetFeatureWithFilter(org.geoserver.test.PagingTest)  Time elapsed: 1103 sec  <<< FAILURE!
      java.lang.AssertionError: expected:<1> but was:<3>
      	at org.junit.Assert.fail(Assert.java:88)
      	at org.junit.Assert.failNotEquals(Assert.java:743)
      	at org.junit.Assert.assertEquals(Assert.java:118)
      	at org.junit.Assert.assertEquals(Assert.java:555)
      	at org.junit.Assert.assertEquals(Assert.java:542)
      	at org.geoserver.test.AbstractAppSchemaTestSupport.assertXpathCount(AbstractAppSchemaTestSupport.java:372)
      	at org.geoserver.test.PagingTest.testGetFeatureWithFilter(PagingTest.java:428)
      [...]
      

      Reverting this recent gs-app-schema-test change does not fix:
      GEOS-8724 Closed Intermittent build failure in NamespacesWfsTest (#2870)
      https://github.com/geoserver/geoserver/commit/75c76394a6249027b3fe27d6d3b8505ef331a69a
      https://osgeo-org.atlassian.net/browse/GEOS-8724

        Attachments

          Issue links

            Activity

              People

              • Assignee:
                Unassigned
                Reporter:
                bencaradocdavies Ben Caradoc-Davies
              • Votes:
                0 Vote for this issue
                Watchers:
                2 Start watching this issue

                Dates

                • Created:
                  Updated:
                  Resolved: